Понедельник, 19 Ноября 2018, 22:25

Приветствую Вас Гость

[ Новые сообщения · Игроделы · Правила · Поиск ]
  • Страница 1 из 1
  • 1
Форум игроделов » Конструкторы игр и лёгкие в освоении системы разработки игр » Game Maker Studio » Ошибка компиляции в Game maker - Android
Ошибка компиляции в Game maker - Android
DarknessStudioДата: Четверг, 24 Марта 2016, 11:32 | Сообщение # 1
был не раз
Сейчас нет на сайте
BUILD FAILED
D:\���������\android-sdk-windows\tools\ant\build.xml:597: The following error occurred while executing this line:
D:\���������\android-sdk-windows\tools\ant\build.xml:649: The following error occurred while executing this line:
D:\���������\android-sdk-windows\tools\ant\build.xml:694: null returned: 1

��������� - это имя пользователя, оно у меня на русском языке happy
qazerДата: Четверг, 24 Марта 2016, 15:13 | Сообщение # 2
Borey Games
Сейчас нет на сайте
Ты пробовал в папку с английским именем класть?
Raven84Дата: Четверг, 24 Марта 2016, 15:28 | Сообщение # 3
старожил
Сейчас нет на сайте
DarknessStudio, Была подобная проблема. Переносил я вроде в папку с англ. названием. Не помню точно что делал. Но после какого-то обновления в пути русские символы точно не распознаются. На их официальном англ. сайте на форуме обсуждался этот вопрос.

The Old Little Hut - игра на Gamiron 12
Idolzzz - игра доступна в Steam и Play Market
Oliver's Adventures in the Fairyland - в разработке
DarknessStudioДата: Пятница, 25 Марта 2016, 11:40 | Сообщение # 4
был не раз
Сейчас нет на сайте
Да, пробовал.
D:\Programms\SDK\tools\ant\build.xml:694: null returned: 1
Вот
Snake174Дата: Пятница, 25 Марта 2016, 13:02 | Сообщение # 5
участник
Сейчас нет на сайте
Попробуй ANT отдельно скачать и в переменных окружения не забудь указать.
http://apache-mirror.rbc.ru/pub/apache//ant/binaries/apache-ant-1.9.6-bin.zip


Не следует обманывать инспектора
Pipmak Assistant
Love2D Exporter
Love2D-Helpers
Old Consoles Games
DarknessStudioДата: Пятница, 25 Марта 2016, 13:05 | Сообщение # 6
был не раз
Сейчас нет на сайте
Попробуй ANT отдельно скачать и в переменных окружения не забудь указать.
http://apache-mirror.rbc.ru/pub/apache//ant/binaries/apache-ant-1.9.6-bin.zip
Что такое окружение?
Snake174Дата: Пятница, 25 Марта 2016, 13:07 | Сообщение # 7
участник
Сейчас нет на сайте
Правой кнопкой по "Мой компьютер" -> Свойства -> Дополнительные параметры системы -> Кнопка "Переменные среды..."

ANT_HOME


Не следует обманывать инспектора
Pipmak Assistant
Love2D Exporter
Love2D-Helpers
Old Consoles Games


Сообщение отредактировал Snake174 - Пятница, 25 Марта 2016, 13:08
DarknessStudioДата: Пятница, 25 Марта 2016, 13:11 | Сообщение # 8
был не раз
Сейчас нет на сайте
А какое значение ставить и куда тот скачанный файл, а то я чайник)
Snake174Дата: Пятница, 25 Марта 2016, 13:18 | Сообщение # 9
участник
Сейчас нет на сайте
Распакуй куда-нибудь и в ANT_HOME укажи этот путь.

http://ant.apache.org/manual/index.html

Добавлено (25 марта 2016, 13:18)
---------------------------------------------
И в PATH добавь %ANT_HOME%/bin
Вроде так.


Не следует обманывать инспектора
Pipmak Assistant
Love2D Exporter
Love2D-Helpers
Old Consoles Games


Сообщение отредактировал Snake174 - Пятница, 25 Марта 2016, 13:18
DarknessStudioДата: Пятница, 25 Марта 2016, 13:21 | Сообщение # 10
был не раз
Сейчас нет на сайте
BUILD FAILED
D:\Programms\SDK\tools\ant\build.xml:597: The following error occurred while executing this line:
D:\Programms\SDK\tools\ant\build.xml:649: The following error occurred while executing this line:
D:\Programms\SDK\tools\ant\build.xml:655: C:\Users\���������\AppData\Local\gm_ttt_51127\SDKLibs\play_apk_expansion\downloader_library\src does not exist.
Это еще что такое?

Добавлено (25 марта 2016, 13:21)
---------------------------------------------
Думаю надо папку создать там?

Snake174Дата: Пятница, 25 Марта 2016, 13:29 | Сообщение # 11
участник
Сейчас нет на сайте
Может версии Android SDK какие-нибудь не стоят?

Вот с форума какой-то ответ. Попробуй так ещё сделать.

Код
no need to downgrade or upgrade your SDK. Follow this step. Go to .../sdk/tools/ant/build.xml and find there:

    <!-- find location of build tools -->
    <getbuildtools name="android.build.tools.dir" verbose="${verbose}" />
add below the lines:

    <property name="aidl" location="${android.build.tools.dir}/aidl${exe}" />
    <property name="aapt" location="${android.build.tools.dir}/aapt${exe}" />
    <property name="dx" location="${android.build.tools.dir}/dx${bat}" />
    <property name="zipalign" location="${android.build.tools.dir}/zipalign${exe}" />


С гамаком не работал. Не знаю. Сейчас гуру гамака набегут и помогут )


Не следует обманывать инспектора
Pipmak Assistant
Love2D Exporter
Love2D-Helpers
Old Consoles Games
DarknessStudioДата: Пятница, 25 Марта 2016, 13:39 | Сообщение # 12
был не раз
Сейчас нет на сайте
Надеюсь... ) Гуру GMS где вы?
Snake174Дата: Пятница, 25 Марта 2016, 13:49 | Сообщение # 13
участник
Сейчас нет на сайте
D:\Programms\SDK\tools\ant\build.xml:597: The following error occurred while executing this line:
D:\Programms\SDK\tools\ant\build.xml:649: The following error occurred while executing this line:

А в этих строках что там?


Не следует обманывать инспектора
Pipmak Assistant
Love2D Exporter
Love2D-Helpers
Old Consoles Games
DarknessStudioДата: Пятница, 25 Марта 2016, 14:00 | Сообщение # 14
был не раз
Сейчас нет на сайте
Ничего нету после двоеточия
Snake174Дата: Пятница, 25 Марта 2016, 14:07 | Сообщение # 15
участник
Сейчас нет на сайте
Библиотеки найти не может. Android SDK и JDK стоят?

Добавлено (25 марта 2016, 14:02)
---------------------------------------------
Переменная окружения JAVA_HOME также должна быть установлена и не оканчиваться на \ или /

Добавлено (25 марта 2016, 14:05)
---------------------------------------------
И в PATH ещё запихни %ANT_HOME%/lib

Добавлено (25 марта 2016, 14:07)
---------------------------------------------
Примерно такое должно быть

Код

ANT_HOME=c:\ant
JAVA_HOME=c:\jdk1.7.0_51
PATH=%PATH%;%ANT_HOME%\bin;%ANT_HOME%\lib;%JAVA_HOME%\bin


Не следует обманывать инспектора
Pipmak Assistant
Love2D Exporter
Love2D-Helpers
Old Consoles Games
DarknessStudioДата: Суббота, 26 Марта 2016, 16:42 | Сообщение # 16
был не раз
Сейчас нет на сайте
Библиотеки все стоят SDK NDK JDK, а PATH это где?
Можно фотку?

Добавлено (25 марта 2016, 17:04)
---------------------------------------------
Я разобрался

BUILD FAILED
D:\Programms\SDK\tools\ant\build.xml:597: The following error occurred while executing this line:
D:\Programms\SDK\tools\ant\build.xml:649: The following error occurred while executing this line:
D:\Programms\SDK\tools\ant\build.xml:694: null returned: 1

Как же это решить? Что-то с SDK. Я его переустанавливал. не робит

Добавлено (25 марта 2016, 20:06)
---------------------------------------------
BUILD FAILED
C:\Users\���������\AppData\Local\gm_ttt_9862\gm_ttt_3843\build.xml:86: Problem: failed to create task or type getbuildtools
Cause: The name is undefined.
Action: Check the spelling.
Action: Check that any custom tasks/types have been declared.
Action: Check that any <presetdef>/<macrodef> declarations have taken place.
это решите

Добавлено (26 марта 2016, 16:42)
---------------------------------------------
помогите

Форум игроделов » Конструкторы игр и лёгкие в освоении системы разработки игр » Game Maker Studio » Ошибка компиляции в Game maker - Android
  • Страница 1 из 1
  • 1
Поиск:

Все права сохранены. GcUp.ru © 2008-2018 Рейтинг